CRAN Package Check Results for Package RColetum

Last updated on 2026-10-08 19:54:40 CEST.

Flavor Version Tinstall Tcheck Ttotal Status Flags
r-devel-linux-x86_64-debian-clang 1.1.0 2.10 30.00 32.10 OK
r-devel-linux-x86_64-debian-gcc 1.1.0 1.80 22.90 24.70 OK
r-devel-linux-x86_64-fedora-clang 1.1.0 21.94 OK
r-devel-linux-x86_64-fedora-gcc 1.1.0 20.58 OK
r-devel-windows-x86_64 1.1.0 4.00 84.00 88.00 OK
r-patched-linux-x86_64 1.1.0 2.43 26.27 28.70 OK
r-release-linux-x86_64 1.1.0 OK
r-release-macos-arm64 1.1.0 1.00 50.00 51.00 OK
r-release-macos-x86_64 1.1.0 2.00 72.00 74.00 OK
r-release-windows-x86_64 1.1.0 4.00 82.00 86.00 OK
r-oldrel-macos-arm64 1.1.0 OK
r-oldrel-macos-x86_64 1.1.0 2.00 77.00 79.00 OK
r-oldrel-windows-x86_64 1.1.0 5.00 66.00 71.00 ERROR

Check Details

Version: 1.1.0
Check: tests
Result: ERROR Running 'testthat.R' [23s] Running the tests in 'tests/testthat.R' failed. Complete output: > library(testthat) > library(RColetum) > > test_check("RColetum") Saving _problems/test-FlattenAnswers-101.R Saving _problems/test-FlattenAnswers-114.R Saving _problems/test-FlattenAnswers-119.R Saving _problems/test-GetAnswers-106.R Saving _problems/test-GetAnswers-114.R Saving _problems/test-GetAnswers-122.R Saving _problems/test-GetAnswers-126.R Saving _problems/test-GetAnswers-133.R Saving _problems/test-GetAnswers-139.R Saving _problems/test-GetAnswers-157.R Saving _problems/test-GetAnswers-167.R Saving _problems/test-GetAnswers-173.R Saving _problems/test-GetAnswers-183.R Saving _problems/test-GetAnswers-192.R Saving _problems/test-GetAnswersComplexForm-61.R Saving _problems/test-GetAnswersComplexForm-66.R Saving _problems/test-GetAnswersComplexForm-87.R Saving _problems/test-GetAnswersComplexForm-93.R Saving _problems/test-GetAnswersComplexForm-99.R Saving _problems/test-GetAnswersComplexForm-110.R Saving _problems/test-GetForm-18.R Saving _problems/test-GetForm-24.R Saving _problems/test-GetForm-36.R Saving _problems/test-GetForm-47.R Saving _problems/test-GetForm-57.R Saving _problems/test-GetForm-77.R Saving _problems/test-GetForm-82.R Saving _problems/test-GetForms-46.R Saving _problems/test-GetForms-52.R Saving _problems/test-GetForms-65.R Saving _problems/test-GetForms-75.R Saving _problems/test-GetForms-88.R [ FAIL 32 | WARN 0 | SKIP 0 | PASS 12 ] ══ Failed tests ════════════════════════════════════════════════════════════════ ── Error ('test-FlattenAnswers.R:101:3'): FlattenAnswers with multivalued group (Storms 5719) ── Error in `restGetFunction(paste0("/forms/", idForm), token)`: Error 503: Backtrace: ▆ 1. ├─RColetum::FlattenAnswers(...) at test-FlattenAnswers.R:101:3 2. │ └─base::is.data.frame(answers) 3. └─RColetum::GetAnswers("cizio7xeohwgc8k4g4koo008kkoocwg", 5719) 4. └─RColetum::GetForm(token, idForm) 5. └─RColetum:::restGetFunction(paste0("/forms/", idForm), token) ── Error ('test-FlattenAnswers.R:114:3'): FlattenAnswers with relational multivalued field (Star Wars 5713) ── Error in `restGetFunction(paste0("/forms/", idForm), token)`: Error 503: Backtrace: ▆ 1. ├─RColetum::FlattenAnswers(...) at test-FlattenAnswers.R:114:3 2. │ └─base::is.data.frame(answers) 3. └─RColetum::GetAnswers("cizio7xeohwgc8k4g4koo008kkoocwg", 5713) 4. └─RColetum::GetForm(token, idForm) 5. └─RColetum:::restGetFunction(paste0("/forms/", idForm), token) ── Error ('test-FlattenAnswers.R:119:3'): FlattenAnswers passes through a plain data.frame unchanged ── Error in `restGetFunction(paste0("/forms/", idForm), token)`: Error 503: Backtrace: ▆ 1. └─RColetum::GetAnswers("cizio7xeohwgc8k4g4koo008kkoocwg", 5705) at test-FlattenAnswers.R:119:3 2. └─RColetum::GetForm(token, idForm) 3. └─RColetum:::restGetFunction(paste0("/forms/", idForm), token) ── Failure ('test-GetAnswers.R:103:3'): error on invalid source filter ───────── `GetAnswers("cizio7xeohwgc8k4g4koo008kkoocwg", 5705, source = "invalid")` threw an error with unexpected message. Expected match: "The option 'invalid' is not available" Actual message: "Error 503: \n" Backtrace: ▆ 1. ├─testthat::expect_error(...) at test-GetAnswers.R:103:3 2. │ └─testthat:::quasi_capture(...) 3. │ ├─testthat (local) .capture(...) 4. │ │ └─base::withCallingHandlers(...) 5. │ └─rlang::eval_bare(quo_get_expr(.quo), quo_get_env(.quo)) 6. └─RColetum::GetAnswers(...) 7. └─RColetum::GetForm(token, idForm) 8. └─RColetum:::restGetFunction(paste0("/forms/", idForm), token) ── Failure ('test-GetAnswers.R:110:3'): error on invalid date format ─────────── `GetAnswers("cizio7xeohwgc8k4g4koo008kkoocwg", 5705, createdAfter = "20-01-2018")` threw an error with unexpected message. Expected match: "ISO 8601 format" Actual message: "Error 503: \n" Backtrace: ▆ 1. ├─testthat::expect_error(...) at test-GetAnswers.R:110:3 2. │ └─testthat:::quasi_capture(...) 3. │ ├─testthat (local) .capture(...) 4. │ │ └─base::withCallingHandlers(...) 5. │ └─rlang::eval_bare(quo_get_expr(.quo), quo_get_env(.quo)) 6. └─RColetum::GetAnswers(...) 7. └─RColetum::GetForm(token, idForm) 8. └─RColetum:::restGetFunction(paste0("/forms/", idForm), token) ── Error ('test-GetAnswers.R:118:3'): warning when both idForm and nameForm are provided ── Error in `restGetFunction(paste0("/forms/", idForm), token)`: Error 503: Backtrace: ▆ 1. ├─testthat::expect_warning(...) at test-GetAnswers.R:118:3 2. │ └─testthat:::quasi_capture(...) 3. │ ├─testthat (local) .capture(...) 4. │ │ └─base::withCallingHandlers(...) 5. │ └─rlang::eval_bare(quo_get_expr(.quo), quo_get_env(.quo)) 6. └─RColetum::GetAnswers(...) 7. └─RColetum::GetForm(token, idForm) 8. └─RColetum:::restGetFunction(paste0("/forms/", idForm), token) ── Error ('test-GetAnswers.R:126:3'): simple form (Iris 5705) returns correct data frame ── Error in `restGetFunction(paste0("/forms/", idForm), token)`: Error 503: Backtrace: ▆ 1. └─RColetum::GetAnswers("cizio7xeohwgc8k4g4koo008kkoocwg", 5705) at test-GetAnswers.R:126:3 2. └─RColetum::GetForm(token, idForm) 3. └─RColetum:::restGetFunction(paste0("/forms/", idForm), token) ── Error ('test-GetAnswers.R:132:3'): simple form works via nameForm ─────────── Error in `restGetFunction(url, token, params)`: Error 503: Backtrace: ▆ 1. └─RColetum::GetAnswers("cizio7xeohwgc8k4g4koo008kkoocwg", nameForm = "RColetum Test - Iris") at test-GetAnswers.R:132:3 2. └─RColetum:::searchFormIdByName(nameForm, token) 3. └─RColetum::GetForms(token) 4. └─RColetum:::fetchAllPages(...) 5. └─RColetum:::restGetFunction(url, token, params) ── Error ('test-GetAnswers.R:139:3'): form with multivalued group (Storms 5719) returns list ── Error in `restGetFunction(paste0("/forms/", idForm), token)`: Error 503: Backtrace: ▆ 1. └─RColetum::GetAnswers("cizio7xeohwgc8k4g4koo008kkoocwg", 5719) at test-GetAnswers.R:139:3 2. └─RColetum::GetForm(token, idForm) 3. └─RColetum:::restGetFunction(paste0("/forms/", idForm), token) ── Error ('test-GetAnswers.R:157:3'): form with relational fields (Star Wars 5713) returns correct list ── Error in `restGetFunction(paste0("/forms/", idForm), token)`: Error 503: Backtrace: ▆ 1. └─RColetum::GetAnswers("cizio7xeohwgc8k4g4koo008kkoocwg", 5713) at test-GetAnswers.R:157:3 2. └─RColetum::GetForm(token, idForm) 3. └─RColetum:::restGetFunction(paste0("/forms/", idForm), token) ── Error ('test-GetAnswers.R:166:3'): pagination: all_pages = FALSE returns only one page ── Error in `restGetFunction(paste0("/forms/", idForm), token)`: Error 503: Backtrace: ▆ 1. └─RColetum::GetAnswers(...) at test-GetAnswers.R:166:3 2. └─RColetum::GetForm(token, idForm) 3. └─RColetum:::restGetFunction(paste0("/forms/", idForm), token) ── Error ('test-GetAnswers.R:173:3'): date filters narrow results ────────────── Error in `restGetFunction(paste0("/forms/", idForm), token)`: Error 503: Backtrace: ▆ 1. └─RColetum::GetAnswers("cizio7xeohwgc8k4g4koo008kkoocwg", 5705) at test-GetAnswers.R:173:3 2. └─RColetum::GetForm(token, idForm) 3. └─RColetum:::restGetFunction(paste0("/forms/", idForm), token) ── Error ('test-GetAnswers.R:182:3'): source filter works ────────────────────── Error in `restGetFunction(paste0("/forms/", idForm), token)`: Error 503: Backtrace: ▆ 1. └─RColetum::GetAnswers(...) at test-GetAnswers.R:182:3 2. └─RColetum::GetForm(token, idForm) 3. └─RColetum:::restGetFunction(paste0("/forms/", idForm), token) ── Error ('test-GetAnswers.R:189:3'): empty result returns correct structure for simple form ── Error in `restGetFunction(paste0("/forms/", idForm), token)`: Error 503: Backtrace: ▆ 1. ├─base::suppressWarnings(...) at test-GetAnswers.R:189:3 2. │ └─base::withCallingHandlers(...) 3. └─RColetum::GetAnswers(...) 4. └─RColetum::GetForm(token, idForm) 5. └─RColetum:::restGetFunction(paste0("/forms/", idForm), token) ── Error ('test-GetAnswersComplexForm.R:61:3'): Classic Rocks main df matches expected ── Error in `restGetFunction(paste0("/forms/", idForm), token)`: Error 503: Backtrace: ▆ 1. └─RColetum::GetAnswers("cizio7xeohwgc8k4g4koo008kkoocwg", 5722) at test-GetAnswersComplexForm.R:61:3 2. └─RColetum::GetForm(token, idForm) 3. └─RColetum:::restGetFunction(paste0("/forms/", idForm), token) ── Error ('test-GetAnswersComplexForm.R:66:3'): Classic Rocks nested dfs have correct names and row counts ── Error in `restGetFunction(paste0("/forms/", idForm), token)`: Error 503: Backtrace: ▆ 1. └─RColetum::GetAnswers("cizio7xeohwgc8k4g4koo008kkoocwg", 5722) at test-GetAnswersComplexForm.R:66:3 2. └─RColetum::GetForm(token, idForm) 3. └─RColetum:::restGetFunction(paste0("/forms/", idForm), token) ── Error ('test-GetAnswersComplexForm.R:87:3'): Classic Rocks Members Active nested df matches expected ── Error in `restGetFunction(paste0("/forms/", idForm), token)`: Error 503: Backtrace: ▆ 1. └─RColetum::GetAnswers("cizio7xeohwgc8k4g4koo008kkoocwg", 5722) at test-GetAnswersComplexForm.R:87:3 2. └─RColetum::GetForm(token, idForm) 3. └─RColetum:::restGetFunction(paste0("/forms/", idForm), token) ── Error ('test-GetAnswersComplexForm.R:93:3'): Classic Rocks Albums nested df matches expected ── Error in `restGetFunction(paste0("/forms/", idForm), token)`: Error 503: Backtrace: ▆ 1. └─RColetum::GetAnswers("cizio7xeohwgc8k4g4koo008kkoocwg", 5722) at test-GetAnswersComplexForm.R:93:3 2. └─RColetum::GetForm(token, idForm) 3. └─RColetum:::restGetFunction(paste0("/forms/", idForm), token) ── Error ('test-GetAnswersComplexForm.R:99:3'): Classic Rocks Genres relational nested df has correct columns ── Error in `restGetFunction(paste0("/forms/", idForm), token)`: Error 503: Backtrace: ▆ 1. └─RColetum::GetAnswers("cizio7xeohwgc8k4g4koo008kkoocwg", 5722) at test-GetAnswersComplexForm.R:99:3 2. └─RColetum::GetForm(token, idForm) 3. └─RColetum:::restGetFunction(paste0("/forms/", idForm), token) ── Error ('test-GetAnswersComplexForm.R:110:3'): Classic Rocks FlattenAnswers produces a single data frame ── Error in `restGetFunction(paste0("/forms/", idForm), token)`: Error 503: Backtrace: ▆ 1. ├─RColetum::FlattenAnswers(...) at test-GetAnswersComplexForm.R:110:3 2. │ └─base::is.data.frame(answers) 3. └─RColetum::GetAnswers("cizio7xeohwgc8k4g4koo008kkoocwg", 5722) 4. └─RColetum::GetForm(token, idForm) 5. └─RColetum:::restGetFunction(paste0("/forms/", idForm), token) ── Failure ('test-GetForm.R:15:3'): error by wrong idForm or nameForm ────────── `GetForm("cizio7xeohwgc8k4g4koo008kkoocwg", 9999)` threw an error with unexpected message. Expected match: "Error 404" Actual message: "Error 503: \n" Backtrace: ▆ 1. ├─testthat::expect_error(...) at test-GetForm.R:15:3 2. │ └─testthat:::quasi_capture(...) 3. │ ├─testthat (local) .capture(...) 4. │ │ └─base::withCallingHandlers(...) 5. │ └─rlang::eval_bare(quo_get_expr(.quo), quo_get_env(.quo)) 6. └─RColetum::GetForm("cizio7xeohwgc8k4g4koo008kkoocwg", 9999) 7. └─RColetum:::restGetFunction(paste0("/forms/", idForm), token) ── Failure ('test-GetForm.R:20:3'): error by wrong idForm or nameForm ────────── `GetForm("cizio7xeohwgc8k4g4koo008kkoocwg", nameForm = "RColetum Test - NaN")` threw an error with unexpected message. Expected match: "Name not found." Actual message: "Error 503: \n" Backtrace: ▆ 1. ├─testthat::expect_error(...) at test-GetForm.R:20:3 2. │ └─testthat:::quasi_capture(...) 3. │ ├─testthat (local) .capture(...) 4. │ │ └─base::withCallingHandlers(...) 5. │ └─rlang::eval_bare(quo_get_expr(.quo), quo_get_env(.quo)) 6. └─RColetum::GetForm("cizio7xeohwgc8k4g4koo008kkoocwg", nameForm = "RColetum Test - NaN") 7. └─RColetum:::searchFormIdByName(nameForm, token) 8. └─RColetum::GetForms(token) 9. └─RColetum:::fetchAllPages(...) 10. └─RColetum:::restGetFunction(url, token, params) ── Error ('test-GetForm.R:33:3'): warning when idForm and nameForm are both provided ── Error in `restGetFunction(paste0("/forms/", idForm), token)`: Error 503: Backtrace: ▆ 1. ├─testthat::expect_warning(...) at test-GetForm.R:33:3 2. │ └─testthat:::quasi_capture(...) 3. │ ├─testthat (local) .capture(...) 4. │ │ └─base::withCallingHandlers(...) 5. │ └─rlang::eval_bare(quo_get_expr(.quo), quo_get_env(.quo)) 6. └─RColetum::GetForm("cizio7xeohwgc8k4g4koo008kkoocwg", 5705, "RColetum Test - Iris") 7. └─RColetum:::restGetFunction(paste0("/forms/", idForm), token) ── Error ('test-GetForm.R:47:3'): GetForm returns correct metadata for Iris (5705) ── Error in `restGetFunction(paste0("/forms/", idForm), token)`: Error 503: Backtrace: ▆ 1. └─RColetum::GetForm("cizio7xeohwgc8k4g4koo008kkoocwg", 5705) at test-GetForm.R:47:3 2. └─RColetum:::restGetFunction(paste0("/forms/", idForm), token) ── Error ('test-GetForm.R:57:3'): GetForm returns correct component structure for Iris (5705) ── Error in `restGetFunction(paste0("/forms/", idForm), token)`: Error 503: Backtrace: ▆ 1. └─RColetum::GetForm("cizio7xeohwgc8k4g4koo008kkoocwg", 5705) at test-GetForm.R:57:3 2. └─RColetum:::restGetFunction(paste0("/forms/", idForm), token) ── Error ('test-GetForm.R:76:3'): GetForm works with nameForm for Iris ───────── Error in `restGetFunction(url, token, params)`: Error 503: Backtrace: ▆ 1. └─RColetum::GetForm("cizio7xeohwgc8k4g4koo008kkoocwg", nameForm = "RColetum Test - Iris") at test-GetForm.R:76:3 2. └─RColetum:::searchFormIdByName(nameForm, token) 3. └─RColetum::GetForms(token) 4. └─RColetum:::fetchAllPages(...) 5. └─RColetum:::restGetFunction(url, token, params) ── Error ('test-GetForm.R:82:3'): GetForm returns correct structure for Classic Rocks (5722) ── Error in `restGetFunction(paste0("/forms/", idForm), token)`: Error 503: Backtrace: ▆ 1. └─RColetum::GetForm("cizio7xeohwgc8k4g4koo008kkoocwg", 5722) at test-GetForm.R:82:3 2. └─RColetum:::restGetFunction(paste0("/forms/", idForm), token) ── Error ('test-GetForms.R:45:3'): get forms with no filter ──────────────────── Error in `restGetFunction(url, token, params)`: Error 503: Backtrace: ▆ 1. ├─dplyr::arrange(...) at test-GetForms.R:45:3 2. └─RColetum::GetForms("cizio7xeohwgc8k4g4koo008kkoocwg") 3. └─RColetum:::fetchAllPages(...) 4. └─RColetum:::restGetFunction(url, token, params) ── Error ('test-GetForms.R:51:3'): get forms filtered by status ──────────────── Error in `restGetFunction(url, token, params)`: Error 503: Backtrace: ▆ 1. └─RColetum::GetForms("cizio7xeohwgc8k4g4koo008kkoocwg", status = "disabled") at test-GetForms.R:51:3 2. └─RColetum:::fetchAllPages(...) 3. └─RColetum:::restGetFunction(url, token, params) ── Error ('test-GetForms.R:65:3'): get forms filtered by name ────────────────── Error in `restGetFunction(url, token, params)`: Error 503: Backtrace: ▆ 1. └─RColetum::GetForms("cizio7xeohwgc8k4g4koo008kkoocwg", name = "Iris") at test-GetForms.R:65:3 2. └─RColetum:::fetchAllPages(...) 3. └─RColetum:::restGetFunction(url, token, params) ── Error ('test-GetForms.R:74:3'): pagination works ──────────────────────────── Error in `restGetFunction(url, token, params)`: Error 503: Backtrace: ▆ 1. └─RColetum::GetForms(...) at test-GetForms.R:74:3 2. └─RColetum:::fetchAllPages(...) 3. └─RColetum:::restGetFunction(url, token, params) ── Error ('test-GetForms.R:84:3'): returns NULL with warning when no forms match ── Error in `restGetFunction(url, token, params)`: Error 503: Backtrace: ▆ 1. ├─testthat::expect_warning(...) at test-GetForms.R:84:3 2. │ └─testthat:::quasi_capture(...) 3. │ ├─testthat (local) .capture(...) 4. │ │ └─base::withCallingHandlers(...) 5. │ └─rlang::eval_bare(quo_get_expr(.quo), quo_get_env(.quo)) 6. └─RColetum::GetForms("cizio7xeohwgc8k4g4koo008kkoocwg", name = "___form_that_does_not_exist___") 7. └─RColetum:::fetchAllPages(...) 8. └─RColetum:::restGetFunction(url, token, params) [ FAIL 32 | WARN 0 | SKIP 0 | PASS 12 ] Error: ! Test failures. Execution halted Flavor: r-oldrel-windows-x86_64